Target
Disintegrin and metalloproteinase domain-containing protein 17
Ligand
BDBM50113040
Substrate
Meas. Tech.
ChEMBL_212741 (CHEMBL816559)
IC50
5±n/a nM
Citation
 Letavic, MAAxt, MZBarberia, JTCarty, TJDanley, DEGeoghegan, KFHalim, NSHoth, LRKamath, AVLaird, ERLopresti-Morrow, LLMcClure, KFMitchell, PGNatarajan, VNoe, MCPandit, JReeves, LSchulte, GKSnow, SLSweeney, FJTan, DHYu, CH Synthesis and biological activity of selective pipecolic acid-based TNF-alpha converting enzyme (TACE) inhibitors. Bioorg Med Chem Lett 12:1387-90 (2002)  
Target
Name:
Disintegrin and metalloproteinase domain-containing protein 17
Synonyms:
ADA17_HUMAN CSVP Disintegrin and metalloproteinase domain-containing protein 17 (ADAM17) TNF-alpha convertase TNF-alpha-converting enzyme (TACE) Tumor necrosis factor-α converting enzyme (TACE)
Type:
Enzyme
Mol. Mass.:
93007.89
Organism:
Homo sapiens (Human)
Description:
Residue:
824
  
Inhibitor
Name:
BDBM50113040
Synonyms:
(2R,4R)-1-[4-(4-Fluoro-benzyloxy)-benzenesulfonyl]-2-hydroxycarbamoyl-piperidine-4-carboxylic acid methyl ester | CHEMBL283026
Type:
Small organic molecule
Emp. Form.:
C21H23FN2O7S
Mol. Mass.:
466.48
SMILES:
COC(=O)[C@@H]1CCN([C@H](C1)C(=O)NO)S(=O)(=O)c1ccc(OCc2ccc(F)cc2)cc1
: