Target
Interstitial collagenase
Ligand
BDBM50113037
Substrate
Meas. Tech.
ChEBML_105983
IC50
3700±n/a nM
Citation
 Letavic, MAAxt, MZBarberia, JTCarty, TJDanley, DEGeoghegan, KFHalim, NSHoth, LRKamath, AVLaird, ERLopresti-Morrow, LLMcClure, KFMitchell, PGNatarajan, VNoe, MCPandit, JReeves, LSchulte, GKSnow, SLSweeney, FJTan, DHYu, CH Synthesis and biological activity of selective pipecolic acid-based TNF-alpha converting enzyme (TACE) inhibitors. Bioorg Med Chem Lett 12:1387-90 (2002)  
Target
Name:
Interstitial collagenase
Synonyms:
CLG MMP1 Matrix metalloproteinase-1 | Matrix metalloproteinase-1 (MMP-1)
Type:
Enzyme
Mol. Mass.:
54010.26
Organism:
Homo sapiens (Human)
Description:
P03956
Residue:
469
  
Inhibitor
Name:
BDBM50113037
Synonyms:
(2R,5R)-5-Hydroxy-1-[4-(4-trifluoromethyl-benzyloxy)-benzenesulfonyl]-piperidine-2-carboxylic acid hydroxyamide | CHEMBL282584
Type:
Small organic molecule
Emp. Form.:
C20H21F3N2O6S
Mol. Mass.:
474.451
SMILES:
ONC(=O)[C@H]1CC[C@@H](O)CN1S(=O)(=O)c1ccc(OCc2ccc(cc2)C(F)(F)F)cc1
: