Target
Interstitial collagenase
Ligand
BDBM50113049
Substrate
Meas. Tech.
ChEBML_105983
IC50
19±n/a nM
Citation
 Letavic, MAAxt, MZBarberia, JTCarty, TJDanley, DEGeoghegan, KFHalim, NSHoth, LRKamath, AVLaird, ERLopresti-Morrow, LLMcClure, KFMitchell, PGNatarajan, VNoe, MCPandit, JReeves, LSchulte, GKSnow, SLSweeney, FJTan, DHYu, CH Synthesis and biological activity of selective pipecolic acid-based TNF-alpha converting enzyme (TACE) inhibitors. Bioorg Med Chem Lett 12:1387-90 (2002)  
Target
Name:
Interstitial collagenase
Synonyms:
CLG MMP1 Matrix metalloproteinase-1 | Matrix metalloproteinase-1 (MMP-1)
Type:
Enzyme
Mol. Mass.:
54010.26
Organism:
Homo sapiens (Human)
Description:
P03956
Residue:
469
  
Inhibitor
Name:
BDBM50113049
Synonyms:
(2R,4R)-2-Hydroxycarbamoyl-1-(4-methoxy-benzenesulfonyl)-piperidine-4-carboxylic acid methyl ester | CHEMBL31928
Type:
Small organic molecule
Emp. Form.:
C15H20N2O7S
Mol. Mass.:
372.393
SMILES:
COC(=O)[C@@H]1CCN([C@H](C1)C(=O)NO)S(=O)(=O)c1ccc(OC)cc1
: