Target
Interstitial collagenase
Ligand
BDBM50113047
Substrate
Meas. Tech.
ChEBML_105983
IC50
2200±n/a nM
Citation
 Letavic, MAAxt, MZBarberia, JTCarty, TJDanley, DEGeoghegan, KFHalim, NSHoth, LRKamath, AVLaird, ERLopresti-Morrow, LLMcClure, KFMitchell, PGNatarajan, VNoe, MCPandit, JReeves, LSchulte, GKSnow, SLSweeney, FJTan, DHYu, CH Synthesis and biological activity of selective pipecolic acid-based TNF-alpha converting enzyme (TACE) inhibitors. Bioorg Med Chem Lett 12:1387-90 (2002)  
Target
Name:
Interstitial collagenase
Synonyms:
CLG MMP1 Matrix metalloproteinase-1 | Matrix metalloproteinase-1 (MMP-1)
Type:
Enzyme
Mol. Mass.:
54010.26
Organism:
Homo sapiens (Human)
Description:
P03956
Residue:
469
  
Inhibitor
Name:
BDBM50113047
Synonyms:
(2R,4S)-4-Hydroxy-1-[4-(2-methoxy-benzyloxy)-benzenesulfonyl]-piperidine-2-carboxylic acid hydroxyamide | CHEMBL28360
Type:
Small organic molecule
Emp. Form.:
C20H24N2O7S
Mol. Mass.:
436.479
SMILES:
COc1ccccc1COc1ccc(cc1)S(=O)(=O)N1CC[C@H](O)C[C@@H]1C(=O)NO
: