Target
Disintegrin and metalloproteinase domain-containing protein 17
Ligand
BDBM50113045
Substrate
Meas. Tech.
ChEBML_90053
IC50
1000±n/a nM
Citation
 Letavic, MAAxt, MZBarberia, JTCarty, TJDanley, DEGeoghegan, KFHalim, NSHoth, LRKamath, AVLaird, ERLopresti-Morrow, LLMcClure, KFMitchell, PGNatarajan, VNoe, MCPandit, JReeves, LSchulte, GKSnow, SLSweeney, FJTan, DHYu, CH Synthesis and biological activity of selective pipecolic acid-based TNF-alpha converting enzyme (TACE) inhibitors. Bioorg Med Chem Lett 12:1387-90 (2002)  
Target
Name:
Disintegrin and metalloproteinase domain-containing protein 17
Synonyms:
ADA17_HUMAN CSVP Disintegrin and metalloproteinase domain-containing protein 17 (ADAM17) TNF-alpha convertase TNF-alpha-converting enzyme (TACE) Tumor necrosis factor-α converting enzyme (TACE)
Type:
Enzyme
Mol. Mass.:
93007.89
Organism:
Homo sapiens (Human)
Description:
Residue:
824
  
Inhibitor
Name:
BDBM50113045
Synonyms:
(2R,5R)-1-[4-(2-Ethyl-benzyloxy)-benzenesulfonyl]-5-hydroxy-piperidine-2-carboxylic acid hydroxyamide | CHEMBL29069
Type:
Small organic molecule
Emp. Form.:
C21H26N2O6S
Mol. Mass.:
434.506
SMILES:
CCc1ccccc1COc1ccc(cc1)S(=O)(=O)N1C[C@H](O)CC[C@@H]1C(=O)NO
: