Target
Disintegrin and metalloproteinase domain-containing protein 17
Ligand
BDBM50113046
Substrate
Meas. Tech.
ChEBML_90053
IC50
1000±n/a nM
Citation
 Letavic, MAAxt, MZBarberia, JTCarty, TJDanley, DEGeoghegan, KFHalim, NSHoth, LRKamath, AVLaird, ERLopresti-Morrow, LLMcClure, KFMitchell, PGNatarajan, VNoe, MCPandit, JReeves, LSchulte, GKSnow, SLSweeney, FJTan, DHYu, CH Synthesis and biological activity of selective pipecolic acid-based TNF-alpha converting enzyme (TACE) inhibitors. Bioorg Med Chem Lett 12:1387-90 (2002)  
Target
Name:
Disintegrin and metalloproteinase domain-containing protein 17
Synonyms:
ADA17_HUMAN CSVP Disintegrin and metalloproteinase domain-containing protein 17 (ADAM17) TNF-alpha convertase TNF-alpha-converting enzyme (TACE) Tumor necrosis factor-α converting enzyme (TACE)
Type:
Enzyme
Mol. Mass.:
93007.89
Organism:
Homo sapiens (Human)
Description:
Residue:
824
  
Inhibitor
Name:
BDBM50113046
Synonyms:
(2R,5R)-5-Hydroxy-1-[4-(2-iodo-benzyloxy)-benzenesulfonyl]-piperidine-2-carboxylic acid hydroxyamide | CHEMBL285272
Type:
Small organic molecule
Emp. Form.:
C19H21IN2O6S
Mol. Mass.:
532.349
SMILES:
ONC(=O)[C@H]1CC[C@@H](O)CN1S(=O)(=O)c1ccc(OCc2ccccc2I)cc1
: