Target
Adenosine receptor A2b
Ligand
BDBM50113253
Substrate
Meas. Tech.
ChEMBL_30305 (CHEMBL636450)
Ki
15400±n/a nM
Citation
 Kim, SAMarshall, MAMelman, NKim, HSMüller, CELinden, JJacobson, KA Structure-activity relationships at human and rat A2B adenosine receptors of xanthine derivatives substituted at the 1-, 3-, 7-, and 8-positions. J Med Chem 45:2131-8 (2002)  
Target
Name:
Adenosine receptor A2b
Synonyms:
AA2BR_HUMAN ADORA2B Adenosine receptors A2b | Adenosine receptors; A2a & A2b
Type:
G Protein-Coupled Receptor (GPCR)
Mol. Mass.:
36341.22
Organism:
Homo sapiens (Human)
Description:
Residue:
332
  
Inhibitor
Name:
BDBM50113253
Synonyms:
8-(2,4-Dinitro-phenyl)-1,3-dimethyl-3,7-dihydro-purine-2,6-dione | CHEMBL304356
Type:
Small organic molecule
Emp. Form.:
C13H10N6O6
Mol. Mass.:
346.2551
SMILES:
Cn1c2nc([nH]c2c(=O)n(C)c1=O)-c1ccc(cc1[N+]([O-])=O)[N+]([O-])=O
: