Target
Cyclin-dependent kinase 1
Ligand
BDBM50235361
Substrate
Meas. Tech.
ChEMBL_2045421 (CHEMBL4700120)
IC50
9600±n/a nM
Citation
 Matheson, CJCoxon, CRBayliss, RBoxall, KCarbain, BFry, AMHardcastle, IRHarnor, SJMas-Droux, CNewell, DRRichards, MWSivaprakasam, MTurner, DGriffin, RJGolding, BTCano, C 2-Arylamino-6-ethynylpurines are cysteine-targeting irreversible inhibitors of Nek2 kinase. RSC Med Chem 11:707-731 (2020)  
Target
Name:
Cyclin-dependent kinase 1
Synonyms:
CDC2 CDK1 CDKN1 Cell division protein kinase 1 P34CDC2 | p34 protein kinase
Type:
Enzyme Subunit
Mol. Mass.:
34101.08
Organism:
Homo sapiens (Human)
Description:
P06493
Residue:
297
  
Inhibitor
Name:
BDBM50235361
Synonyms:
CHEMBL4074015
Type:
Small organic molecule
Emp. Form.:
C13H10N6O2S
Mol. Mass.:
314.323
SMILES:
NS(=O)(=O)c1ccc(Nc2nc(C#C)c3nc[nH]c3n2)cc1
: