Target
Serine/threonine-protein kinase Nek2
Ligand
BDBM50553210
Substrate
Meas. Tech.
ChEMBL_2045427 (CHEMBL4700126)
IC50
100±n/a nM
Citation
 Matheson, CJCoxon, CRBayliss, RBoxall, KCarbain, BFry, AMHardcastle, IRHarnor, SJMas-Droux, CNewell, DRRichards, MWSivaprakasam, MTurner, DGriffin, RJGolding, BTCano, C 2-Arylamino-6-ethynylpurines are cysteine-targeting irreversible inhibitors of Nek2 kinase. RSC Med Chem 11:707-731 (2020)  
Target
Name:
Serine/threonine-protein kinase Nek2
Synonyms:
NEK kinase NEK2A NLK1
Type:
Enzyme
Mol. Mass.:
51776.96
Organism:
Homo sapiens (Human)
Description:
P51955
Residue:
445
  
Inhibitor
Name:
BDBM50553210
Synonyms:
CHEMBL4754015
Type:
Small organic molecule
Emp. Form.:
C15H10N6O
Mol. Mass.:
290.2795
SMILES:
O=C1Cc2cc(Nc3nc(C#C)c4nc[nH]c4n3)ccc2N1
: