Target
Serine/threonine-protein kinase Nek2
Ligand
BDBM50553212
Substrate
Meas. Tech.
ChEMBL_2045427 (CHEMBL4700126)
IC50
10.0±n/a nM
Citation
 Matheson, CJCoxon, CRBayliss, RBoxall, KCarbain, BFry, AMHardcastle, IRHarnor, SJMas-Droux, CNewell, DRRichards, MWSivaprakasam, MTurner, DGriffin, RJGolding, BTCano, C 2-Arylamino-6-ethynylpurines are cysteine-targeting irreversible inhibitors of Nek2 kinase. RSC Med Chem 11:707-731 (2020)  
Target
Name:
Serine/threonine-protein kinase Nek2
Synonyms:
NEK kinase NEK2A NLK1
Type:
Enzyme
Mol. Mass.:
51776.96
Organism:
Homo sapiens (Human)
Description:
P51955
Residue:
445
  
Inhibitor
Name:
BDBM50553212
Synonyms:
CHEMBL4763380
Type:
Small organic molecule
Emp. Form.:
C17H14N6O
Mol. Mass.:
318.3327
SMILES:
CN1CCc2ccc(Nc3nc(C#C)c4nc[nH]c4n3)cc2C1=O
: