Target
Cyclin-dependent kinase 7
Ligand
BDBM50235361
Substrate
Meas. Tech.
ChEMBL_2045471 (CHEMBL4700170)
IC50
36100±n/a nM
Citation
 Matheson, CJCoxon, CRBayliss, RBoxall, KCarbain, BFry, AMHardcastle, IRHarnor, SJMas-Droux, CNewell, DRRichards, MWSivaprakasam, MTurner, DGriffin, RJGolding, BTCano, C 2-Arylamino-6-ethynylpurines are cysteine-targeting irreversible inhibitors of Nek2 kinase. RSC Med Chem 11:707-731 (2020)  
Target
Name:
Cyclin-dependent kinase 7
Synonyms:
39 kDa protein kinase CAK1 CDK-activating kinase 1 (CAK) CDK7_HUMAN Cell division protein kinase 7 Cyclin-dependent kinase 7 (CDK7/cyclin H) P39 Mo15 TFIIH basal transcription factor complex kinase subunit
Type:
Enzyme Subunit
Mol. Mass.:
39047.01
Organism:
Homo sapiens (Human)
Description:
Residue:
346
  
Inhibitor
Name:
BDBM50235361
Synonyms:
CHEMBL4074015
Type:
Small organic molecule
Emp. Form.:
C13H10N6O2S
Mol. Mass.:
314.323
SMILES:
NS(=O)(=O)c1ccc(Nc2nc(C#C)c3nc[nH]c3n2)cc1
: