Target
Serine protease 1
Ligand
BDBM50113591
Substrate
Meas. Tech.
ChEBML_213048
IC50
194±n/a nM
Citation
 Song, YClizbe, LBhakta, CTeng, WLi, WWu, YJia, ZJZhang, PWang, LDoughan, BSu, TKanter, JWoolfrey, JWong, PHuang, BTran, KSinha, UPark, GReed, AMalinowski, JHollenbach, SScarborough, RMZhu, BY Design, synthesis, and SAR of substituted acrylamides as factor Xa inhibitors. Bioorg Med Chem Lett 12:1511-5 (2002)  
Target
Name:
Serine protease 1
Synonyms:
Alpha-trypsin chain 1 Beta-trypsin PRSS1 TRP1 TRY1_HUMAN Thrombin & trypsin Trypsin I | Trypsin-1
Type:
Enzyme
Mol. Mass.:
26557.80
Organism:
Homo sapiens (Human)
Description:
P07477
Residue:
247
  
Inhibitor
Name:
BDBM50113591
Synonyms:
(E)-3-(3-Carbamimidoyl-phenyl)-2-fluoro-but-2-enoic acid (3-fluoro-2'-sulfamoyl-biphenyl-4-yl)-amide CHEMBL287252
Type:
Small organic molecule
Emp. Form.:
C23H20F2N4O3S
Mol. Mass.:
470.492
SMILES:
C\C(=C(/F)C(=O)Nc1ccc(cc1F)-c1ccccc1S(N)(=O)=O)c1cccc(c1)C(N)=N
: