Target
Cyclin-dependent kinase 1
Ligand
BDBM50093397
Substrate
Meas. Tech.
ChEMBL_50316 (CHEMBL661621)
IC50
620000±n/a nM
Citation
 Naumann, TMatter, H Structural classification of protein kinases using 3D molecular interaction field analysis of their ligand binding sites: target family landscapes. J Med Chem 45:2366-78 (2002)  
Target
Name:
Cyclin-dependent kinase 1
Synonyms:
CDC2 CDK1 CDKN1 Cell division protein kinase 1 P34CDC2 | p34 protein kinase
Type:
Enzyme Subunit
Mol. Mass.:
34101.08
Organism:
Homo sapiens (Human)
Description:
P06493
Residue:
297
  
Inhibitor
Name:
BDBM50093397
Synonyms:
(R){1-[6-(3-Chloro-phenylamino)-9-isopropyl-9H-purin-2-yl]-pyrrolidin-2-yl}-methanol CHEMBL77369
Type:
Small organic molecule
Emp. Form.:
C19H23ClN6O
Mol. Mass.:
386.879
SMILES:
CC(C)n1cnc2c(Nc3cccc(Cl)c3)nc(nc12)N1CCC[C@@H]1CO
: