Target
Vasopressin V1a receptor
Ligand
BDBM50114025
Substrate
Meas. Tech.
ChEMBL_214412 (CHEMBL820276)
Ki
2.12±n/a nM
Citation
 Kakefuda, ASuzuki, TTobe, TTsukada, JTahara, ASakamoto, STsukamoto, S Synthesis and pharmacological evaluation of 5-(4-biphenyl)-3-methyl-4-phenyl-1,2,4-triazole derivatives as a novel class of selective antagonists for the human vasopressin V(1A) receptor. J Med Chem 45:2589-98 (2002)  
Target
Name:
Vasopressin V1a receptor
Synonyms:
AVPR V1a AVPR1A V1AR_HUMAN VASOPRESSIN V1A Vasopressin V1 receptor Vasopressin receptor
Type:
Receptor
Mol. Mass.:
46820.18
Organism:
Homo sapiens (Human)
Description:
P37288
Residue:
418
  
Inhibitor
Name:
BDBM50114025
Synonyms:
4-{4-[2-(3-Biphenyl-4-yl-5-methyl-[1,2,4]triazol-4-yl)-phenoxy]-butyl}-piperidine | CHEMBL432375
Type:
Small organic molecule
Emp. Form.:
C30H34N4O
Mol. Mass.:
466.6172
SMILES:
Cc1nnc(-c2ccc(cc2)-c2ccccc2)n1-c1ccccc1OCCCCC1CCNCC1
: