Target
Myeloperoxidase
Ligand
BDBM357645
Substrate
Meas. Tech.
ChEMBL_2048400 (CHEMBL4703099)
IC50
127±n/a nM
Citation
 Shaw, SAVokits, BPDilger, AKViet, AClark, CGAbell, LMLocke, GADuke, GKopcho, LMDongre, AGao, JKrishnakumar, AJusuf, SKhan, JSpronk, SABasso, MDZhao, LCantor, GHOnorato, JMWexler, RRDuclos, FKick, EK Discovery and structure activity relationships of 7-benzyl triazolopyridines as stable, selective, and reversible inhibitors of myeloperoxidase. Bioorg Med Chem 28:0 (2020)  
Target
Name:
Myeloperoxidase
Synonyms:
84 kDa myeloperoxidase MPO Myeloperoxidase Myeloperoxidase heavy chain PERM_HUMAN
Type:
Enzyme
Mol. Mass.:
83888.32
Organism:
Homo sapiens (Human)
Description:
P05164
Residue:
745
  
Inhibitor
Name:
BDBM357645
Synonyms:
US10214527, Example 17
Type:
Small organic molecule
Emp. Form.:
C18H15N5
Mol. Mass.:
301.3452
SMILES:
Nc1cc(Cc2cccc(c2)-c2ccccc2)c2nn[nH]c2n1
: