Target
Fibroblast growth factor receptor 4
Ligand
BDBM50554188
Substrate
Meas. Tech.
ChEMBL_2048648 (CHEMBL4703347)
IC50
0.400000±n/a nM
Citation
 Rezende Miranda, RFu, YChen, XPerino, JCao, PCarpten, JChen, YZhang, C Development of a Potent and Specific FGFR4 Inhibitor for the Treatment of Hepatocellular Carcinoma. J Med Chem 63:11484-11497 (2020)  
Target
Name:
Fibroblast growth factor receptor 4
Synonyms:
CD_antigen: CD334 FGFR4 FGFR4 Fibroblast growth factor receptor JK2 TKF
Type:
Protein
Mol. Mass.:
87957.45
Organism:
Homo sapiens (Human)
Description:
P22455
Residue:
802
  
Inhibitor
Name:
BDBM50554188
Synonyms:
CHEMBL4744686
Type:
Small organic molecule
Emp. Form.:
C27H24Cl2N6O3
Mol. Mass.:
551.424
SMILES:
COc1cc(OC)c(Cl)c(Nc2ncccc2-c2cc(Nc3c(C)cccc3NC(=O)C=C)ncn2)c1Cl
: