Target
Lysine-specific histone demethylase 1A
Ligand
BDBM283129
Substrate
Meas. Tech.
ChEMBL_2048837 (CHEMBL4703536)
IC50
0.700000±n/a nM
Citation
 Kanouni, TSeverin, CCho, RWYuen, NYXu, JShi, LLai, CDel Rosario, JRStansfield, RKLawton, LNHosfield, DO'Connell, SKreilein, MMTavares-Greco, PNie, ZKaldor, SWVeal, JMStafford, JAChen, YK Discovery of CC-90011: A Potent and Selective Reversible Inhibitor of Lysine Specific Demethylase 1 (LSD1). J Med Chem 63:14522-14529 (2020)  
Target
Name:
Lysine-specific histone demethylase 1A
Synonyms:
AOF2 Flavin-containing amine oxidase domain-containing protein 2 KDM1A KIAA0601 Lysine-specific demethylase 1 (LSD1) Lysine-specific histone demethylase 1 (LSD1)
Type:
Enzyme
Mol. Mass.:
92901.01
Organism:
Homo sapiens (Human)
Description:
O60341
Residue:
852
  
Inhibitor
Name:
BDBM283129
Synonyms:
4-[2-(4-amino-piperidin-1-yl)-5- (4-methoxyphenyl)-1-methyl-6-oxo- 1,6-dihydro-pyrimidin-4-yl]- benzonitrile US10207999, Example 2 US10548896, Example 2 US10960005, Example 2 US9573930, Example 2 US9776974, Example 2
Type:
Small organic molecule
Emp. Form.:
C24H25N5O2
Mol. Mass.:
415.4876
SMILES:
COc1ccc(cc1)-c1c(nc(N2CCC(N)CC2)n(C)c1=O)-c1ccc(cc1)C#N
: