Target
Neuronal acetylcholine receptor subunit alpha-3/beta-2
Ligand
BDBM50554893
Substrate
Meas. Tech.
ChEMBL_2050878 (CHEMBL4705577)
IC50
7.5±n/a nM
Citation
 Zhu, XPan, SXu, MZhang, LYu, JYu, JWu, YFan, YLi, HKasheverov, IEKudryavtsev, DSTsetlin, VIXue, YZhangsun, DWang, XLuo, S High Selectivity of an ?-Conotoxin LvIA Analogue for ?3?2 Nicotinic Acetylcholine Receptors Is Mediated by ?2 Functionally Important Residues. J Med Chem 63:13656-13668 (2020)  
Target
Name:
Neuronal acetylcholine receptor subunit alpha-3/beta-2
Synonyms:
Neuronal acetylcholine receptor Alpha-3/Beta-2 Neuronal acetylcholine receptor; alpha3/beta2 | nAChR subtypes alpha3 beta2
Type:
Protein
Mol. Mass.:
Description:
Components:
This complex has 2 components.
Component 1
Name:
Neuronal acetylcholine receptor subunit alpha-3
Synonyms:
ACHA3_RAT Chrna3
Type:
Enzyme
Mol. Mass.:
56995.52
Organism:
Rattus norvegicus (Rat)
Description:
P04757
Residue:
499
  
Component 2
Name:
Neuronal acetylcholine receptor subunit beta-2
Synonyms:
ACHB2_RAT Chrnb2 Neuronal acetylcholine receptor non-alpha-1 chain
Type:
Enzyme
Mol. Mass.:
56910.32
Organism:
Rattus norvegicus (Rat)
Description:
P12390
Residue:
500
  
Inhibitor
Name:
BDBM50554893
Synonyms:
CHEMBL4752161
Type:
Small organic molecule
Emp. Form.:
C68H103N21O21S4
Mol. Mass.:
1678.934
SMILES:
CC[C@H](C)[C@@H]1NC(=O)[C@H](CCC(O)=O)NC(=O)[C@@H]2CCCN2C(=O)[C@H](Cc2cnc[nH]2)NC(=O)[C@H](CC(O)=O)NC(=O)[C@@H](NC(=O)[C@@H](NC(=O)[C@@H]2CSSC[C@H](NC(=O)CN)C(=O)N[C@@H](CSSC[C@H](NC1=O)C(N)=O)C(=O)N[C@@H](CO)C(=O)N[C@@H](Cc1cnc[nH]1)C(=O)N1CCC[C@H]1C(=O)N[C@@H](C)C(=O)N2)[C@@H](C)CC)C(C)C
: