Target
Potassium voltage-gated channel subfamily H member 2
Ligand
BDBM50555366
Substrate
Meas. Tech.
ChEMBL_2051795 (CHEMBL4706796)
IC50
500±n/a nM
Citation
 Kokkonda, SDeng, XWhite, KLCoteron, JMMarco, Mde Las Heras, LWhite, JEl Mazouni, FTomchick, DRManjalanagara, KRudra, KRChen, GMorizzi, JRyan, EKaminsky, WLeroy, DMartínez-Martínez, MSJimenez-Diaz, MBBazaga, SFAngulo-Barturen, IWaterson, DBurrows, JNMatthews, DCharman, SAPhillips, MARathod, PK Tetrahydro-2-naphthyl and 2-Indanyl Triazolopyrimidines Targeting Plasmodium falciparum Dihydroorotate Dehydrogenase Display Potent and Selective Antimalarial Activity. J Med Chem 59:5416-31 (2016)  
Target
Name:
Potassium voltage-gated channel subfamily H member 2
Synonyms:
1,3-beta-glucan synthase component GLS2 ERG Eag-related protein 1 Ether-a-go-go-related gene (HERG) Ether-a-go-go-related gene potassium channel 1 Ether-a-go-go-related gene potassium channel 1 (hERG1) Ether-a-go-go-related protein 1 H-ERG KCNH2 Potassium voltage-gated channel subfamily H member 2 (hERG) Voltage-gated potassium channel subunit Kv11.1 hERG Potassium Channel 1 | putative potassium channel subunit
Type:
Multi-pass membrane protein
Mol. Mass.:
126672.65
Organism:
Homo sapiens (Human)
Description:
Q12809
Residue:
1159
  
Inhibitor
Name:
BDBM50555366
Synonyms:
CHEMBL4747214
Type:
Small organic molecule
Emp. Form.:
C18H18BrF2N5
Mol. Mass.:
422.27
SMILES:
Cc1cc(NC2CCc3cc(Br)ccc3C2)n2nc(nc2n1)C(C)(F)F
: