Target
Cytochrome P450 2C8
Ligand
BDBM50555366
Substrate
Meas. Tech.
ChEMBL_2051801 (CHEMBL4706802)
IC50
18700±n/a nM
Citation
 Kokkonda, SDeng, XWhite, KLCoteron, JMMarco, Mde Las Heras, LWhite, JEl Mazouni, FTomchick, DRManjalanagara, KRudra, KRChen, GMorizzi, JRyan, EKaminsky, WLeroy, DMartínez-Martínez, MSJimenez-Diaz, MBBazaga, SFAngulo-Barturen, IWaterson, DBurrows, JNMatthews, DCharman, SAPhillips, MARathod, PK Tetrahydro-2-naphthyl and 2-Indanyl Triazolopyrimidines Targeting Plasmodium falciparum Dihydroorotate Dehydrogenase Display Potent and Selective Antimalarial Activity. J Med Chem 59:5416-31 (2016)  
Target
Name:
Cytochrome P450 2C8
Synonyms:
CP2C8_HUMAN CYPIIC8 P450 IIC2 P450 form 1 | S-mephenytoin 4-hydroxylase
Type:
Protein
Mol. Mass.:
55839.23
Organism:
Homo sapiens (Human)
Description:
P10632
Residue:
490
  
Inhibitor
Name:
BDBM50555366
Synonyms:
CHEMBL4747214
Type:
Small organic molecule
Emp. Form.:
C18H18BrF2N5
Mol. Mass.:
422.27
SMILES:
Cc1cc(NC2CCc3cc(Br)ccc3C2)n2nc(nc2n1)C(C)(F)F
: