Target
Endoplasmin
Ligand
BDBM50555416
Substrate
Meas. Tech.
ChEMBL_2052002 (CHEMBL4707003)
IC50
245±n/a nM
Citation
 Jiang, FWang, HJJin, YHZhang, QWang, ZHJia, JMLiu, FWang, LBao, QCLi, DDYou, QDXu, XL Novel Tetrahydropyrido[4,3-d]pyrimidines as Potent Inhibitors of Chaperone Heat Shock Protein 90. J Med Chem 59:10498-10519 (2016)  
Target
Name:
Endoplasmin
Synonyms:
94 kDa glucose-regulated protein GRP-94 Glucose regulated protein 94kDa (Grp94) Heat shock protein 90 kDa beta member 1 Tumor rejection antigen 1 | gp96 homolog
Type:
Protein
Mol. Mass.:
92417.36
Organism:
Homo sapiens (Human)
Description:
P14625
Residue:
803
  
Inhibitor
Name:
BDBM50555416
Synonyms:
CHEMBL4781723
Type:
Small organic molecule
Emp. Form.:
C18H21N3O3
Mol. Mass.:
327.3776
SMILES:
CC(C)c1cc(C(=O)N2CCc3nc(C)ncc3C2)c(O)cc1O
: