Target
Endoplasmin
Ligand
BDBM50555430
Substrate
Meas. Tech.
ChEMBL_2052002 (CHEMBL4707003)
IC50
498±n/a nM
Citation
 Jiang, FWang, HJJin, YHZhang, QWang, ZHJia, JMLiu, FWang, LBao, QCLi, DDYou, QDXu, XL Novel Tetrahydropyrido[4,3-d]pyrimidines as Potent Inhibitors of Chaperone Heat Shock Protein 90. J Med Chem 59:10498-10519 (2016)  
Target
Name:
Endoplasmin
Synonyms:
94 kDa glucose-regulated protein GRP-94 Glucose regulated protein 94kDa (Grp94) Heat shock protein 90 kDa beta member 1 Tumor rejection antigen 1 | gp96 homolog
Type:
Protein
Mol. Mass.:
92417.36
Organism:
Homo sapiens (Human)
Description:
P14625
Residue:
803
  
Inhibitor
Name:
BDBM50555430
Synonyms:
CHEMBL4778735
Type:
Small organic molecule
Emp. Form.:
C18H21N3O4
Mol. Mass.:
343.377
SMILES:
COc1ncc2CN(CCc2n1)C(=O)c1cc(C(C)C)c(O)cc1O
: