Target
Cannabinoid receptor 2
Ligand
BDBM50451432
Substrate
Meas. Tech.
ChEMBL_47134 (CHEMBL653699)
Ki
103±n/a nM
Citation
 Hynes, JLeftheris, KWu, HPandit, CChen, PNorris, DJChen, BCZhao, RKiener, PAChen, XTurk, LAPatil-Koota, VGillooly, KMShuster, DJMcIntyre, KW C-3 Amido-indole cannabinoid receptor modulators. Bioorg Med Chem Lett 12:2399-402 (2002)  
Target
Name:
Cannabinoid receptor 2
Synonyms:
CANNABINOID CB2 CB2 CB2B CNR2_HUMAN Cannabinoid CB2 receptor Cannabinoid receptor 2 (CB2R) | hCB2
Type:
G Protein-Coupled Receptor (GPCR)
Mol. Mass.:
39690.94
Organism:
Homo sapiens (Human)
Description:
P34972
Residue:
360
  
Inhibitor
Name:
BDBM50451432
Synonyms:
CHEMBL2112292
Type:
Small organic molecule
Emp. Form.:
C28H41N3O3
Mol. Mass.:
467.6434
SMILES:
CCc1c(C(=O)N[C@H]2C3(C)CCC(C3)C2(C)C)c2cccc(OC)c2n1CCN1CCOCC1
: