Target
Cannabinoid receptor 2
Ligand
BDBM50451435
Substrate
Meas. Tech.
ChEMBL_47134 (CHEMBL653699)
Ki
5±n/a nM
Citation
 Hynes, JLeftheris, KWu, HPandit, CChen, PNorris, DJChen, BCZhao, RKiener, PAChen, XTurk, LAPatil-Koota, VGillooly, KMShuster, DJMcIntyre, KW C-3 Amido-indole cannabinoid receptor modulators. Bioorg Med Chem Lett 12:2399-402 (2002)  
Target
Name:
Cannabinoid receptor 2
Synonyms:
CANNABINOID CB2 CB2 CB2B CNR2_HUMAN Cannabinoid CB2 receptor Cannabinoid receptor 2 (CB2R) | hCB2
Type:
G Protein-Coupled Receptor (GPCR)
Mol. Mass.:
39690.94
Organism:
Homo sapiens (Human)
Description:
P34972
Residue:
360
  
Inhibitor
Name:
BDBM50451435
Synonyms:
CHEMBL2112289
Type:
Small organic molecule
Emp. Form.:
C26H38N2O2
Mol. Mass.:
410.5921
SMILES:
[H][C@@]12CC[C@@](C)(C1)C(NC(=O)c1c(C)n(CCCCC)c3c(OC)cccc13)C2(C)C
: