Target
Cannabinoid receptor 2
Ligand
BDBM50116835
Substrate
Meas. Tech.
ChEMBL_47134 (CHEMBL653699)
Ki
31±n/a nM
Citation
 Hynes, JLeftheris, KWu, HPandit, CChen, PNorris, DJChen, BCZhao, RKiener, PAChen, XTurk, LAPatil-Koota, VGillooly, KMShuster, DJMcIntyre, KW C-3 Amido-indole cannabinoid receptor modulators. Bioorg Med Chem Lett 12:2399-402 (2002)  
Target
Name:
Cannabinoid receptor 2
Synonyms:
CANNABINOID CB2 CB2 CB2B CNR2_HUMAN Cannabinoid CB2 receptor Cannabinoid receptor 2 (CB2R) | hCB2
Type:
G Protein-Coupled Receptor (GPCR)
Mol. Mass.:
39690.94
Organism:
Homo sapiens (Human)
Description:
P34972
Residue:
360
  
Inhibitor
Name:
BDBM50116835
Synonyms:
(S)-3-(3-Chloro-phenyl)-2-{[7-methoxy-2-methyl-1-(2-morpholin-4-yl-ethyl)-1H-indole-3-carbonyl]-amino}-propionic acid methyl ester | CHEMBL309868
Type:
Small organic molecule
Emp. Form.:
C27H32ClN3O5
Mol. Mass.:
514.013
SMILES:
COC(=O)[C@H](Cc1cccc(Cl)c1)NC(=O)c1c(C)n(CCN2CCOCC2)c2c(OC)cccc12
: