Target
Cannabinoid receptor 2
Ligand
BDBM50116846
Substrate
Meas. Tech.
ChEBML_46979
Ki
86±n/a nM
Citation
 Hynes, JLeftheris, KWu, HPandit, CChen, PNorris, DJChen, BCZhao, RKiener, PAChen, XTurk, LAPatil-Koota, VGillooly, KMShuster, DJMcIntyre, KW C-3 Amido-indole cannabinoid receptor modulators. Bioorg Med Chem Lett 12:2399-402 (2002)  
Target
Name:
Cannabinoid receptor 2
Synonyms:
CANNABINOID CB2 CB2 CB2B CNR2_HUMAN Cannabinoid CB2 receptor Cannabinoid receptor 2 (CB2R) | hCB2
Type:
G Protein-Coupled Receptor (GPCR)
Mol. Mass.:
39690.94
Organism:
Homo sapiens (Human)
Description:
P34972
Residue:
360
  
Inhibitor
Name:
BDBM50116846
Synonyms:
(S)-2-[(E)-3-(4-Methoxy-3-pentyloxy-phenyl)-acryloylamino]-3-phenyl-propionic acid methyl ester | CHEMBL81708
Type:
Small organic molecule
Emp. Form.:
C25H31NO5
Mol. Mass.:
425.5173
SMILES:
CCCCCOc1cc(\C=C\C(=O)N[C@@H](Cc2ccccc2)C(=O)OC)ccc1OC
: