Target
Cannabinoid receptor 2
Ligand
BDBM50116850
Substrate
Meas. Tech.
ChEMBL_47134 (CHEMBL653699)
Ki
235±n/a nM
Citation
 Hynes, JLeftheris, KWu, HPandit, CChen, PNorris, DJChen, BCZhao, RKiener, PAChen, XTurk, LAPatil-Koota, VGillooly, KMShuster, DJMcIntyre, KW C-3 Amido-indole cannabinoid receptor modulators. Bioorg Med Chem Lett 12:2399-402 (2002)  
Target
Name:
Cannabinoid receptor 2
Synonyms:
CANNABINOID CB2 CB2 CB2B CNR2_HUMAN Cannabinoid CB2 receptor Cannabinoid receptor 2 (CB2R) | hCB2
Type:
G Protein-Coupled Receptor (GPCR)
Mol. Mass.:
39690.94
Organism:
Homo sapiens (Human)
Description:
P34972
Residue:
360
  
Inhibitor
Name:
BDBM50116850
Synonyms:
7-Methoxy-2-methyl-1-(2-morpholin-4-yl-ethyl)-1H-indole-3-carboxylic acid ((S)-1-isoxazol-3-yl-2-phenyl-ethyl)-amide | CHEMBL419289
Type:
Small organic molecule
Emp. Form.:
C28H32N4O4
Mol. Mass.:
488.5781
SMILES:
COc1cccc2c(C(=O)N[C@@H](Cc3ccccc3)c3ccon3)c(C)n(CCN3CCOCC3)c12
: