Target
Cannabinoid receptor 2
Ligand
BDBM50116862
Substrate
Meas. Tech.
ChEBML_46979
Ki
120±n/a nM
Citation
 Hynes, JLeftheris, KWu, HPandit, CChen, PNorris, DJChen, BCZhao, RKiener, PAChen, XTurk, LAPatil-Koota, VGillooly, KMShuster, DJMcIntyre, KW C-3 Amido-indole cannabinoid receptor modulators. Bioorg Med Chem Lett 12:2399-402 (2002)  
Target
Name:
Cannabinoid receptor 2
Synonyms:
CANNABINOID CB2 CB2 CB2B CNR2_HUMAN Cannabinoid CB2 receptor Cannabinoid receptor 2 (CB2R) | hCB2
Type:
G Protein-Coupled Receptor (GPCR)
Mol. Mass.:
39690.94
Organism:
Homo sapiens (Human)
Description:
P34972
Residue:
360
  
Inhibitor
Name:
BDBM50116862
Synonyms:
(S)-3-(4-Hydroxy-phenyl)-2-[(E)-3-(4-methoxy-3-pentyloxy-phenyl)-acryloylamino]-propionic acid methyl ester | CHEMBL309553
Type:
Small organic molecule
Emp. Form.:
C25H31NO6
Mol. Mass.:
441.5167
SMILES:
CCCCCOc1cc(\C=C\C(=O)N[C@@H](Cc2ccc(O)cc2)C(=O)OC)ccc1OC
: