Target
Mitogen-activated protein kinase 11
Ligand
BDBM50556597
Substrate
Meas. Tech.
ChEMBL_2056714 (CHEMBL4711715)
Kd
20±n/a nM
Citation
 Röhm, SSchröder, MDwyer, JEWiddowson, CSChaikuad, ABerger, BTJoerger, ACKrämer, AHarbig, JDauch, DKudolo, MLaufer, SBagley, MCKnapp, S Selective targeting of the ?C and DFG-out pocket in p38 MAPK. Eur J Med Chem 208:0 (2020)  
Target
Name:
Mitogen-activated protein kinase 11
Synonyms:
MAP kinase p38 MK11_HUMAN Mitogen-activated protein kinase p38 beta SAPK2 Stress-activated protein kinase 2 p38-2 p38b
Type:
Enzyme Catalytic Domain
Mol. Mass.:
41351.73
Organism:
Homo sapiens (Human)
Description:
gi_20128774
Residue:
364
  
Inhibitor
Name:
BDBM50556597
Synonyms:
CHEMBL4756586
Type:
Small organic molecule
Emp. Form.:
C30H38N6O3
Mol. Mass.:
530.6611
SMILES:
CCNC(=O)[C@H](CCC1CCCCC1)NC(=O)c1ccc(CNC(=O)c2cnn(c2N)-c2ccccc2)cc1
: