Target
Melatonin receptor type 1A/1B
Ligand
BDBM50118454
Substrate
Meas. Tech.
ChEMBL_104946 (CHEMBL713113)
Ki
6.8±n/a nM
Citation
 Fukatsu, KUchikawa, OKawada, MYamano, TYamashita, MKato, KHirai, KHinuma, SMiyamoto, MOhkawa, S Synthesis of a novel series of benzocycloalkene derivatives as melatonin receptor agonists. J Med Chem 45:4212-21 (2002)  
Target
Name:
Melatonin receptor type 1A/1B
Synonyms:
Melatonin receptor
Type:
Mol. Mass.:
Description:
ASSAY_ID of ChEMBL is 104946
Components:
This complex has 2 components.
Component 1
Name:
Melatonin receptor type 1A
Synonyms:
MTNR1A MTR1A_HUMAN Mel1a melatonin receptor Melatonin receptor Melatonin receptor type 1 (MT1) | Melatonin receptor type 1A
Type:
Enzyme
Mol. Mass.:
39392.94
Organism:
Homo sapiens (Human)
Description:
P48039
Residue:
350
  
Component 2
Name:
Melatonin receptor type 1B
Synonyms:
MTNR1B Mel-1B-R Melatonin 1B Melatonin receptor type 1B | Melatonin receptor type 2 (MT2)
Type:
Enzyme
Mol. Mass.:
40203.54
Organism:
Homo sapiens (Human)
Description:
P49286
Residue:
362
  
Inhibitor
Name:
BDBM50118454
Synonyms:
CHEMBL135305 | N-[2-(2-Benzyl-6-methoxy-3H-inden-1-yl)-ethyl]-2,2,2-trifluoro-acetamide
Type:
Small organic molecule
Emp. Form.:
C21H20F3NO2
Mol. Mass.:
375.3842
SMILES:
COc1ccc2CC(Cc3ccccc3)=C(CCNC(=O)C(F)(F)F)c2c1
: