Target
Thyroid hormone receptor beta
Ligand
BDBM50085448
Substrate
Meas. Tech.
ChEMBL_2058576 (CHEMBL4713577)
Kd
0.550000±n/a nM
Citation
 Sandner, ANgo, KSchiebel, JPizarroso, AIMSchmidt, LWenzel, BSteinmetzer, TOstermann, AHeine, AKlebe, G How a Fragment Draws Attention to Selectivity Discriminating Features between the Related Proteases Trypsin and Thrombin. J Med Chem 64:1611-1625 (2021)  
Target
Name:
Thyroid hormone receptor beta
Synonyms:
ERBA2 Nuclear receptor subfamily 1 group A member 2 THR1 c-erbA-2 | c-erbA-beta
Type:
Receptor
Mol. Mass.:
52793.62
Organism:
Homo sapiens (Human)
Description:
Recombinant hThR was obtained from nuclear extracts from SF9 cells infected with baculovirus vectors encoding for ThRbeta 1.
Residue:
461
  
Inhibitor
Name:
BDBM50085448
Synonyms:
(S)-1-((R)-2-Amino-3-phenyl-propionyl)-pyrrolidine-2-carboxylic acid 4-carbamimidoyl-benzylamide D-Phe-Pro-p-amindinobenzylamine
Type:
Small organic molecule
Emp. Form.:
C22H27N5O2
Mol. Mass.:
393.4821
SMILES:
N[C@H](Cc1ccccc1)C(=O)N1CCC[C@H]1C(=O)NCc1ccc(cc1)C(N)=N
: