Target
Receptor-type tyrosine-protein phosphatase F
Ligand
BDBM50118751
Substrate
Meas. Tech.
ChEMBL_162594 (CHEMBL768410)
pH
5.5±n/a
Ki
550000±n/a nM
Comments
extracted
Citation
 Andersen, HSOlsen, OHIversen, LFSørensen, ALMortensen, SBChristensen, MSBranner, SHansen, TKLau, JFJeppesen, LMoran, EJSu, JBakir, FJudge, LShahbaz, MCollins, TVo, TNewman, MJRipka, WCMøller, NP Discovery and SAR of a novel selective and orally bioavailable nonpeptide classical competitive inhibitor class of protein-tyrosine phosphatase 1B. J Med Chem 45:4443-59 (2002)  
Target
Name:
Receptor-type tyrosine-protein phosphatase F
Synonyms:
LAR Leukocyte common antigen related (LAR) PTPRF_HUMAN Receptor-type tyrosine-protein phosphatase F (LAR)
Type:
Protein
Mol. Mass.:
212869.85
Organism:
Homo sapiens (Human)
Description:
P10586
Residue:
1907
  
Inhibitor
Name:
BDBM50118751
Synonyms:
6-(Oxalyl-amino)-1H-indole-7-carboxylic acid CHEMBL341806
Type:
Small organic molecule
Emp. Form.:
C11H8N2O5
Mol. Mass.:
248.1916
SMILES:
OC(=O)C(=O)Nc1ccc2cc[nH]c2c1C(O)=O
: