Target
Squalene synthase
Ligand
BDBM50118892
Substrate
Meas. Tech.
ChEMBL_225035 (CHEMBL844995)
IC50
89±n/a nM
Citation
 Miki, TKori, MMabuchi, HTozawa, RNishimoto, TSugiyama, YTeshima, KYukimasa, H Synthesis of novel 4,1-benzoxazepine derivatives as squalene synthase inhibitors and their inhibition of cholesterol synthesis. J Med Chem 45:4571-80 (2002)  
Target
Name:
Squalene synthase
Synonyms:
FDFT1 FPP:FPP farnesyltransferase SQS Squalene synthetase
Type:
PROTEIN
Mol. Mass.:
48114.76
Organism:
Homo sapiens (Human)
Description:
ChEMBL_1352847
Residue:
417
  
Inhibitor
Name:
BDBM50118892
Synonyms:
CHEMBL341795 | Isobutyric acid 3-[3-[2-(4-carboxymethyl-piperidin-1-yl)-2-oxo-ethyl]-7-chloro-5-(2,3-dimethoxy-phenyl)-2-oxo-2,3-dihydro-5H-benzo[e][1,4]oxazepin-1-yl]-2,2-dimethyl-propyl ester
Type:
Small organic molecule
Emp. Form.:
C35H45ClN2O9
Mol. Mass.:
673.193
SMILES:
COc1cccc([C@H]2O[C@H](CC(=O)N3CCC(CC(O)=O)CC3)C(=O)N(CC(C)(C)COC(=O)C(C)C)c3ccc(Cl)cc23)c1OC
: