Target
Squalene synthase
Ligand
BDBM50409607
Substrate
Meas. Tech.
ChEMBL_225034 (CHEMBL844994)
IC50
21±n/a nM
Citation
 Miki, TKori, MMabuchi, HTozawa, RNishimoto, TSugiyama, YTeshima, KYukimasa, H Synthesis of novel 4,1-benzoxazepine derivatives as squalene synthase inhibitors and their inhibition of cholesterol synthesis. J Med Chem 45:4571-80 (2002)  
Target
Name:
Squalene synthase
Synonyms:
FDFT1 FPP:FPP farnesyltransferase SQS Squalene synthetase
Type:
PROTEIN
Mol. Mass.:
48114.76
Organism:
Homo sapiens (Human)
Description:
ChEMBL_1352847
Residue:
417
  
Inhibitor
Name:
BDBM50409607
Synonyms:
CHEMBL2112799
Type:
Small organic molecule
Emp. Form.:
C27H33ClN2O8
Mol. Mass.:
549.013
SMILES:
COc1cccc([C@H]2O[C@H](CC(=O)N[C@@H](C)C(O)=O)C(=O)N(CC(C)(C)CO)c3ccc(Cl)cc23)c1OC
: