Target
High affinity nerve growth factor receptor
Ligand
BDBM50557927
Substrate
Meas. Tech.
ChEMBL_2060785 (CHEMBL4716038)
Ki
66±n/a nM
Citation
 Subramanian, GVairagoundar, RBowen, SJRoush, NZachary, TJavens, CWilliams, TJanssen, AGonzales, A Synthetic inhibitor leads of human tropomyosin receptor kinase A ( RSC Med Chem 11:370-377 (2020)  
Target
Name:
High affinity nerve growth factor receptor
Synonyms:
2.7.10.1 NTRK1 NTRK1_HUMAN Neurotrophic tyrosine kinase receptor type 1 Synonyms=MTC TRK1-transforming tyrosine kinase protein TRKA GN Trk-A Tropomyosin-related kinase A Tyrosine kinase receptor Tyrosine kinase receptor A Tyrosine kinase receptor A (Trk-A) gp140trk | p140-TrkA
Type:
Mol. Mass.:
87498.18
Organism:
Homo sapiens (Human)
Description:
P04629
Residue:
796
  
Inhibitor
Name:
BDBM50557927
Synonyms:
CHEMBL4788009
Type:
Small organic molecule
Emp. Form.:
C21H17F3N6O
Mol. Mass.:
426.3945
SMILES:
Cc1nc2nc(nn2c(C)c1CC(=O)Nc1cccc(c1)C(F)(F)F)-c1cccnc1
: