Target
Delta-type opioid receptor
Ligand
BDBM50120058
Substrate
Meas. Tech.
ChEBML_147337
Ki
5216±n/a nM
Citation
 Roy, CLi, TKrasik, PGilbert, MJPelletier, CGagnon, DRobert, EDucharme, JStorer, RLavallée, JF Synthesis and structure--activity relationship of novel aminotetralin derivatives with high micro selective opioid affinity. Bioorg Med Chem Lett 12:3141-3 (2002)  
Target
Name:
Delta-type opioid receptor
Synonyms:
D-OR-1 Delta opioid receptor OPIATE Delta OPRD1 OPRK1 | opioid receptor, delta 1
Type:
G Protein-Coupled Receptor (GPCR)
Mol. Mass.:
40382.98
Organism:
Homo sapiens (Human)
Description:
Competition binding assays were carried out using membrane preparations from transfected HN9.10 cells that constitutively expressed the delta opioid receptor.
Residue:
372
  
Inhibitor
Name:
BDBM50120058
Synonyms:
7-Amino-6-methoxy-8,8-dimethyl-5,6,7,8-tetrahydro-naphthalen-2-ol | CHEMBL106432
Type:
Small organic molecule
Emp. Form.:
C13H19NO2
Mol. Mass.:
221.2955
SMILES:
CO[C@@H]1Cc2ccc(O)cc2C(C)(C)[C@@H]1N
: