Target
Large neutral amino acids transporter small subunit 1
Ligand
BDBM18140
Substrate
Meas. Tech.
ChEMBL_2063643 (CHEMBL4718896)
IC50
150000±n/a nM
Citation
 Zur, AAChien, HCAugustyn, EFlint, AHeeren, NFinke, KHernandez, CHansen, LMiller, SLin, LGiacomini, KMColas, CSchlessinger, AThomas, AA LAT1 activity of carboxylic acid bioisosteres: Evaluation of hydroxamic acids as substrates. Bioorg Med Chem Lett 26:5000-5006 (2016)  
Target
Name:
Large neutral amino acids transporter small subunit 1
Synonyms:
4F2 LC 4F2LC CD98LC Integral membrane protein E16 LAT1 Large neutral amino acids transporter small subunit 1 SLC7A5 hLAT1 | y+ system cationic amino acid transporter
Type:
PROTEIN
Mol. Mass.:
55013.61
Organism:
Homo sapiens (Human)
Description:
ChEMBL_100160
Residue:
507
  
Inhibitor
Name:
BDBM18140
Synonyms:
(2S,3S)-2-amino-3-methylpentanoic acid L-[14C]Isoleucine
Type:
Amino Acid
Emp. Form.:
C6H13NO2
Mol. Mass.:
131.1729
SMILES:
CC[C@H](C)[C@H](N)C(O)=O
: