Target
D(2) dopamine receptor
Ligand
BDBM50120921
Substrate
Meas. Tech.
ChEMBL_61625 (CHEMBL673081)
Ki
635±n/a nM
Citation
 Liégeois, JFEyrolles, LEllenbroek, BALejeune, CCarato, PBruhwyler, JGéczy, JDamas, JDelarge, J New pyridobenzodiazepine derivatives: modifications of the basic side chain differentially modulate binding to dopamine (D(4.2), D(2L)) and serotonin (5-HT(2A)) receptors. J Med Chem 45:5136-49 (2002)  
Target
Name:
D(2) dopamine receptor
Synonyms:
D(2) dopamine receptor DOPAMINE D2 Long DRD2 Dopamine D2 receptor Dopamine D2 receptor (D2R) Dopamine2-like | d2
Type:
Cell-surface receptors
Mol. Mass.:
50647.10
Organism:
Homo sapiens (Human)
Description:
P14416
Residue:
443
  
Inhibitor
Name:
BDBM50120921
Synonyms:
8-Methyl-6-(4-phenethyl-piperazin-1-yl)-11H-benzo[e]pyrido[3,2-b][1,4]diazepine | CHEMBL422310
Type:
Small organic molecule
Emp. Form.:
C25H27N5
Mol. Mass.:
397.5154
SMILES:
Cc1ccc2Nc3ncccc3N=C(N3CCN(CCc4ccccc4)CC3)c2c1
: