Target
D(4) dopamine receptor
Ligand
BDBM50120921
Substrate
Meas. Tech.
ChEMBL_60696 (CHEMBL676506)
Ki
37±n/a nM
Citation
 Liégeois, JFEyrolles, LEllenbroek, BALejeune, CCarato, PBruhwyler, JGéczy, JDamas, JDelarge, J New pyridobenzodiazepine derivatives: modifications of the basic side chain differentially modulate binding to dopamine (D(4.2), D(2L)) and serotonin (5-HT(2A)) receptors. J Med Chem 45:5136-49 (2002)  
Target
Name:
D(4) dopamine receptor
Synonyms:
D(2C) dopamine receptor DOPAMINE D4.2 DRD4 Dopamine D4 receptor
Type:
Enzyme
Mol. Mass.:
48373.19
Organism:
Homo sapiens (Human)
Description:
P21917
Residue:
419
  
Inhibitor
Name:
BDBM50120921
Synonyms:
8-Methyl-6-(4-phenethyl-piperazin-1-yl)-11H-benzo[e]pyrido[3,2-b][1,4]diazepine | CHEMBL422310
Type:
Small organic molecule
Emp. Form.:
C25H27N5
Mol. Mass.:
397.5154
SMILES:
Cc1ccc2Nc3ncccc3N=C(N3CCN(CCc4ccccc4)CC3)c2c1
: