Target
5-hydroxytryptamine receptor 2A
Ligand
BDBM50120921
Substrate
Meas. Tech.
ChEMBL_2666 (CHEMBL617914)
Ki
36±n/a nM
Citation
 Liégeois, JFEyrolles, LEllenbroek, BALejeune, CCarato, PBruhwyler, JGéczy, JDamas, JDelarge, J New pyridobenzodiazepine derivatives: modifications of the basic side chain differentially modulate binding to dopamine (D(4.2), D(2L)) and serotonin (5-HT(2A)) receptors. J Med Chem 45:5136-49 (2002)  
Target
Name:
5-hydroxytryptamine receptor 2A
Synonyms:
5-HT-2A 5-HT2A 5-hydroxytryptamine receptor 2A (5HT2A) Htr2 Serotonin Receptor 2A
Type:
G Protein-Coupled Receptor (GPCR)
Mol. Mass.:
52852.05
Organism:
Rattus norvegicus (rat)
Description:
Rat cortex membranes 5-HT2A receptors.
Residue:
471
  
Inhibitor
Name:
BDBM50120921
Synonyms:
8-Methyl-6-(4-phenethyl-piperazin-1-yl)-11H-benzo[e]pyrido[3,2-b][1,4]diazepine | CHEMBL422310
Type:
Small organic molecule
Emp. Form.:
C25H27N5
Mol. Mass.:
397.5154
SMILES:
Cc1ccc2Nc3ncccc3N=C(N3CCN(CCc4ccccc4)CC3)c2c1
: