Target
Leukotriene A-4 hydrolase
Ligand
BDBM50121000
Substrate
Meas. Tech.
ChEBML_96943
IC50
15±n/a nM
Citation
 Penning, TDChandrakumar, NSDesai, BNDjuric, SWGasiecki, AFLiang, CDMiyashiro, JMRussell, MAAskonas, LJGierse, JKHarding, EIHighkin, MKKachur, JFKim, SHVillani-Price, DPyla, EYGhoreishi-Haack, NSSmith, WG Pyrrolidine and piperidine analogues of SC-57461A as potent, orally active inhibitors of leukotriene A(4) hydrolase. Bioorg Med Chem Lett 12:3383-6 (2002)  
Target
Name:
Leukotriene A-4 hydrolase
Synonyms:
LKHA4_HUMAN LTA4 Leukotriene A(4) hydrolase Leukotriene A4 hydrolase
Type:
Hydrolase; metalloprotease
Mol. Mass.:
69280.41
Organism:
Homo sapiens (Human)
Description:
Human recombinant LTA4H.
Residue:
611
  
Inhibitor
Name:
BDBM50121000
Synonyms:
CHEMBL116174 | {2-[2-(4-Benzyl-phenoxy)-ethyl]-2-aza-bicyclo[2.2.1]hept-5-yl}-acetic acid methyl ester
Type:
Small organic molecule
Emp. Form.:
C24H29NO3
Mol. Mass.:
379.492
SMILES:
COC(=O)CC1CC2CC1CN2CCOc1ccc(Cc2ccccc2)cc1
: