Target
Protein kinase C iota type
Ligand
BDBM2579
Substrate
Meas. Tech.
ChEMBL_2065336 (CHEMBL4720589)
IC50
16.7±n/a nM
Citation
 Hou, WRen, YZhang, ZSun, HMa, YYan, B Novel quinazoline derivatives bearing various 6-benzamide moieties as highly selective and potent EGFR inhibitors. Bioorg Med Chem 26:1740-1750 (2018)  
Target
Name:
Protein kinase C iota type
Synonyms:
Atypical protein kinase C-lambda/iota KPCI_HUMAN PRKCI Protein kinase C iota Protein kinase C iota type aPKC-lambda/iota | nPKC-iota
Type:
Enzyme
Mol. Mass.:
68251.56
Organism:
Homo sapiens (Human)
Description:
P41743
Residue:
596
  
Inhibitor
Name:
BDBM2579
Synonyms:
(2S,3R,4R,6R)-3-methoxy-2-methyl-4-(methylamino)-29-oxa-1,7,17-triazaoctacyclo[12.12.2.1^{2,6}.0^{7,28}.0^{8,13}.0^{15,19}.0^{20,27}.0^{21,26}]nonacosa-8(13),9,11,14(28),15(19),20(27),21(26),22,24-nonaen-16-one Staurosporin, 4 Staurosporine, 8 US9206188, Staurosporine | US9226923, Staurosporine
Type:
Small organic molecule
Emp. Form.:
C28H26N4O3
Mol. Mass.:
466.531
SMILES:
CN[C@@H]1C[C@H]2O[C@@](C)([C@@H]1OC)n1c3ccccc3c3c4CNC(=O)c4c4c5ccccc5n2c4c13
: