Target
Cytochrome c oxidase subunit 2
Ligand
BDBM50558938
Substrate
Meas. Tech.
ChEMBL_2067170 (CHEMBL4722423)
IC50
8940±n/a nM
Citation
 Jan, MSAhmad, SHussain, FAhmad, AMahmood, FRashid, UAbid, OUUllah, FAyaz, MSadiq, A Design, synthesis, in-vitro, in-vivo and in-silico studies of pyrrolidine-2,5-dione derivatives as multitarget anti-inflammatory agents. Eur J Med Chem 186:0 (2020)  
Target
Name:
Cytochrome c oxidase subunit 2
Synonyms:
COII COX2_HUMAN MT-CO2 | MTCO2
Type:
PROTEIN
Mol. Mass.:
25555.66
Organism:
Homo sapiens (Human)
Description:
ChEMBL_530099
Residue:
227
  
Inhibitor
Name:
BDBM50558938
Synonyms:
CHEMBL4797337
Type:
Small organic molecule
Emp. Form.:
C17H15N3O5S
Mol. Mass.:
373.383
SMILES:
NS(=O)(=O)c1ccc(cc1)N1C(=O)CC(CC(=O)c2ccccn2)C1=O
: