Target
Cytochrome c oxidase subunit 2
Ligand
BDBM50558946
Substrate
Meas. Tech.
ChEMBL_2067170 (CHEMBL4722423)
IC50
21860±n/a nM
Citation
 Jan, MSAhmad, SHussain, FAhmad, AMahmood, FRashid, UAbid, OUUllah, FAyaz, MSadiq, A Design, synthesis, in-vitro, in-vivo and in-silico studies of pyrrolidine-2,5-dione derivatives as multitarget anti-inflammatory agents. Eur J Med Chem 186:0 (2020)  
Target
Name:
Cytochrome c oxidase subunit 2
Synonyms:
COII COX2_HUMAN MT-CO2 | MTCO2
Type:
PROTEIN
Mol. Mass.:
25555.66
Organism:
Homo sapiens (Human)
Description:
ChEMBL_530099
Residue:
227
  
Inhibitor
Name:
BDBM50558946
Synonyms:
CHEMBL4792260
Type:
Small organic molecule
Emp. Form.:
C18H21NO3
Mol. Mass.:
299.3642
SMILES:
CC1CCC(=O)C(C1)C1CC(=O)N(Cc2ccccc2)C1=O
: