Target
Polyunsaturated fatty acid 5-lipoxygenase
Ligand
BDBM50558934
Substrate
Meas. Tech.
ChEMBL_2067172 (CHEMBL4722425)
IC50
860±n/a nM
Citation
 Jan, MSAhmad, SHussain, FAhmad, AMahmood, FRashid, UAbid, OUUllah, FAyaz, MSadiq, A Design, synthesis, in-vitro, in-vivo and in-silico studies of pyrrolidine-2,5-dione derivatives as multitarget anti-inflammatory agents. Eur J Med Chem 186:0 (2020)  
Target
Name:
Polyunsaturated fatty acid 5-lipoxygenase
Synonyms:
5-LO 5-Lipoxygenase (5-LO) 5-Lipoygenase ALOX5 LOG5 | LOX5_HUMAN
Type:
Enzyme
Mol. Mass.:
77972.74
Organism:
Homo sapiens (Human)
Description:
Recombinant protein was purified from E. coli lysate. After ammonium sulfate precipitation and subsequent steps, the supernatant (S100) was used for 5-LO activity assay.
Residue:
674
  
Inhibitor
Name:
BDBM50558934
Synonyms:
CHEMBL4754218
Type:
Small organic molecule
Emp. Form.:
C19H18N2O5S
Mol. Mass.:
386.422
SMILES:
Cc1ccc(cc1)C(=O)CC1CC(=O)N(C1=O)c1ccc(cc1)S(N)(=O)=O
: