Target
Polyunsaturated fatty acid 5-lipoxygenase
Ligand
BDBM50558935
Substrate
Meas. Tech.
ChEMBL_2067172 (CHEMBL4722425)
IC50
12590±n/a nM
Citation
 Jan, MSAhmad, SHussain, FAhmad, AMahmood, FRashid, UAbid, OUUllah, FAyaz, MSadiq, A Design, synthesis, in-vitro, in-vivo and in-silico studies of pyrrolidine-2,5-dione derivatives as multitarget anti-inflammatory agents. Eur J Med Chem 186:0 (2020)  
Target
Name:
Polyunsaturated fatty acid 5-lipoxygenase
Synonyms:
5-LO 5-Lipoxygenase (5-LO) 5-Lipoygenase ALOX5 LOG5 | LOX5_HUMAN
Type:
Enzyme
Mol. Mass.:
77972.74
Organism:
Homo sapiens (Human)
Description:
Recombinant protein was purified from E. coli lysate. After ammonium sulfate precipitation and subsequent steps, the supernatant (S100) was used for 5-LO activity assay.
Residue:
674
  
Inhibitor
Name:
BDBM50558935
Synonyms:
CHEMBL4742170
Type:
Small organic molecule
Emp. Form.:
C18H15ClN2O5S
Mol. Mass.:
406.84
SMILES:
NS(=O)(=O)c1ccc(cc1)N1C(=O)CC(CC(=O)c2ccc(Cl)cc2)C1=O
: