Target
Amiloride-sensitive amine oxidase [copper-containing]
Ligand
BDBM50121457
Substrate
Meas. Tech.
ChEBML_53891
Ki
25000±n/a nM
Citation
 Manna, FChimenti, FBolasco, ASecci, DBizzarri, BBefani, OTurini, PMondovi, BAlcaro, STafi, A Inhibition of amine oxidases activity by 1-acetyl-3,5-diphenyl-4,5-dihydro-(1H)-pyrazole derivatives. Bioorg Med Chem Lett 12:3629-33 (2002)  
Target
Name:
Amiloride-sensitive amine oxidase [copper-containing]
Synonyms:
ABP AOC1 Amiloride-binding protein DAO1 Diamine oxidase (DAO) KAO | Kidney amine oxidase
Type:
Protein
Mol. Mass.:
85387.64
Organism:
Homo sapiens (Human)
Description:
P19801
Residue:
751
  
Inhibitor
Name:
BDBM50121457
Synonyms:
1-[3-(2,4-Dihydroxy-phenyl)-5-m-tolyl-4,5-dihydro-pyrazol-1-yl]-ethanone | CHEMBL121432
Type:
Small organic molecule
Emp. Form.:
C18H18N2O3
Mol. Mass.:
310.3471
SMILES:
CC(=O)N1N=C(CC1c1cccc(C)c1)c1ccc(O)cc1O
: