Target
Cathepsin S
Ligand
BDBM50121541
Substrate
Meas. Tech.
ChEMBL_48674 (CHEMBL658345)
Kd
3±n/a nM
Citation
 Ward, YDThomson, DSFrye, LLCywin, CLMorwick, TEmmanuel, MJZindell, RMcNeil, DBekkali, YGirardot, MHrapchak, MDeTuri, MCrane, KWhite, DPav, SWang, YHao, MHGrygon, CALabadia, MEFreeman, DMDavidson, WHopkins, JLBrown, MLSpero, DMGiradot, M Design and synthesis of dipeptide nitriles as reversible and potent Cathepsin S inhibitors. J Med Chem 45:5471-82 (2002)  
Target
Name:
Cathepsin S
Synonyms:
CATS_HUMAN Cathepsin S (Cat S) | cathepsin S preproprotein
Type:
Protein
Mol. Mass.:
37507.38
Organism:
Homo sapiens (Human)
Description:
P25774
Residue:
331
  
Inhibitor
Name:
BDBM50121541
Synonyms:
CHEMBL346448 | Morpholine-4-carboxylic acid (1-{[cyano-(2-methyl-benzyloxymethyl)-methyl]-carbamoyl}-3-methyl-butyl)-amide
Type:
Small organic molecule
Emp. Form.:
C22H32N4O4
Mol. Mass.:
416.5139
SMILES:
CC(C)C[C@H](NC(=O)N1CCOCC1)C(=O)N[C@@H](COCc1ccccc1C)C#N
: