Target
Retinoic acid receptor RXR-beta
Ligand
BDBM50122349
Substrate
Meas. Tech.
ChEMBL_197062 (CHEMBL807509)
EC50
22±n/a nM
Citation
 Farmer, LJZhi, LJeong, SLamph, WWOsburn, DLCroston, GFlatten, KSHeyman, RANadzan, AM Retinoic acid receptor ligands based on the 6-cyclopropyl-2,4-hexadienoic acid. Bioorg Med Chem Lett 13:261-4 (2002)  
Target
Name:
Retinoic acid receptor RXR-beta
Synonyms:
Nr2b2 Retinoid X receptor beta | Rxrb
Type:
PROTEIN
Mol. Mass.:
55877.78
Organism:
Mus musculus
Description:
ChEMBL_196588
Residue:
520
  
Inhibitor
Name:
BDBM50122349
Synonyms:
(2E,4E)-6-[1-(6-tert-Butyl-1,1-dimethyl-indan-4-yl)-cyclopropyl]-3-methyl-hexa-2,4-dienoic acid | CHEMBL88216
Type:
Small organic molecule
Emp. Form.:
C25H34O2
Mol. Mass.:
366.5363
SMILES:
C\C(\C=C\CC1(CC1)c1cc(cc2c1CCC2(C)C)C(C)(C)C)=C/C(O)=O
: