Target
Retinoic acid receptor alpha
Ligand
BDBM50122349
Substrate
Meas. Tech.
ChEMBL_197406 (CHEMBL799796)
Kd
>1000±n/a nM
Citation
 Farmer, LJZhi, LJeong, SLamph, WWOsburn, DLCroston, GFlatten, KSHeyman, RANadzan, AM Retinoic acid receptor ligands based on the 6-cyclopropyl-2,4-hexadienoic acid. Bioorg Med Chem Lett 13:261-4 (2002)  
Target
Name:
Retinoic acid receptor alpha
Synonyms:
NR1B1 RAR-alpha RARA_HUMAN Retinoic acid receptor alpha/Retinoid X receptor alpha Retinoid receptor
Type:
PROTEIN
Mol. Mass.:
50778.87
Organism:
Homo sapiens (Human)
Description:
ChEMBL_1466191
Residue:
462
  
Inhibitor
Name:
BDBM50122349
Synonyms:
(2E,4E)-6-[1-(6-tert-Butyl-1,1-dimethyl-indan-4-yl)-cyclopropyl]-3-methyl-hexa-2,4-dienoic acid | CHEMBL88216
Type:
Small organic molecule
Emp. Form.:
C25H34O2
Mol. Mass.:
366.5363
SMILES:
C\C(\C=C\CC1(CC1)c1cc(cc2c1CCC2(C)C)C(C)(C)C)=C/C(O)=O
: